BDBM50185130 CHEMBL207494::methyl3beta-hydroxyolean-12-en-27-oate
SMILES COC(=O)[C@@]12CC[C@@]3(C)CCC(C)(C)C[C@H]3C1=CC[C@@H]1[C@@]3(C)CC[C@H](O)C(C)(C)C3CC[C@@]21C
InChI Key InChIKey=HEDYWHFMTAMIIX-IPZPPPCKSA-N
Data  1 IC50
  Tab Delimited (TSV)   2D SDfile   Computed 3D by Vconf -m prep SDfile
Find this compound or compounds like it in BindingDB:
Activity Spreadsheet -- Enzyme Inhibition Constant Data from BindingDB
Found 1 hit for monomerid = 50185130
TargetTyrosine-protein phosphatase non-receptor type 1(Homo sapiens (Human))
Korea Research Institute Of Bioscience And Biotechnology
Curated by ChEMBL
LigandPNGBDBM50185130(CHEMBL207494 | methyl3beta-hydroxyolean-12-en-27-o...)
Affinity DataIC50:  1.60E+4nM. Assay description: Inhibition of human recombinant PTP1B
In DepthDetails ArticlePubMed