BDBM50185364 CHEMBL2371908::CHEMBL415187::Sub[-Tyr-Arg-Leu-Arg-Tyr-NH2]2
SMILES [#6]-[#6](-[#6])-[#6]-[#6@H](-[#7]-[#6](=O)-[#6@H](-[#6]-[#6]-[#6]\[#7]=[#6](/[#7])-[#7])-[#7]-[#6](=O)-[#6@H](-[#6]-c1ccc(-[#8])cc1)-[#7]-[#6](=O)-[#6@@H](-[#7])-[#6]-[#6]-[#6]-[#6]-[#6@H](-[#7])-[#6](=O)-[#7]-[#6@@H](-[#6]-c1ccc(-[#8])cc1)-[#6](=O)-[#7]-[#6@@H](-[#6]-[#6]-[#6]\[#7]=[#6](/[#7])-[#7])-[#6](=O)-[#7]-[#6@@H](-[#6]-[#6](-[#6])-[#6])-[#6](=O)-[#7]-[#6@@H](-[#6]-[#6]-[#6]\[#7]=[#6](/[#7])-[#7])-[#6](=O)-[#7]-[#6@@H](-[#6]-c1ccc(-[#8])cc1)-[#6](-[#8])=O)-[#6](=O)-[#7]-[#6@@H](-[#6]-[#6]-[#6]\[#7]=[#6](/[#7])-[#7])-[#6](=O)-[#7]-[#6@@H](-[#6]-c1ccc(-[#8])cc1)-[#6](-[#8])=O
InChI Key InChIKey=FPKKOJOGVASCPV-NHMXRAEOSA-N
Data  3 KI  2 EC50
  Tab Delimited (TSV)   2D SDfile   Computed 3D by Vconf -m prep SDfile
Find this compound or compounds like it in BindingDB:
Activity Spreadsheet -- Enzyme Inhibition Constant Data from BindingDB
Found 5 hits for monomerid = 50185364
TargetNeuropeptide Y receptor type 4(Homo sapiens (Human))
University Of Cincinnati
Curated by ChEMBL
LigandPNGBDBM50185364(CHEMBL2371908 | CHEMBL415187 | Sub[-Tyr-Arg-Leu-Ar...)
Affinity DataKi:  0.0500nM. Assay description: Displacement of [125I]hPP from human NPY4 receptor expressed in CHO cells
In DepthDetails ArticlePubMed
TargetNeuropeptide Y receptor type 1(Homo sapiens (Human))
University Of Cincinnati
Curated by ChEMBL
LigandPNGBDBM50185364(CHEMBL2371908 | CHEMBL415187 | Sub[-Tyr-Arg-Leu-Ar...)
Affinity DataKi:  7.5nM. Assay description: Displacement of [125I]NPY from human NPY1 receptor expressed in CHO cells
In DepthDetails ArticlePubMed
TargetNeuropeptide Y receptor type 2(Homo sapiens (Human))
University Of Cincinnati
Curated by ChEMBL
LigandPNGBDBM50185364(CHEMBL2371908 | CHEMBL415187 | Sub[-Tyr-Arg-Leu-Ar...)
Affinity DataKi:  890nM. Assay description: Displacement of [125I]NPY from human NPY2 receptor expressed in CHO cells
In DepthDetails ArticlePubMed
TargetNeuropeptide Y receptor type 1(Homo sapiens (Human))
University Of Cincinnati
Curated by ChEMBL
LigandPNGBDBM50185364(CHEMBL2371908 | CHEMBL415187 | Sub[-Tyr-Arg-Leu-Ar...)
Affinity DataEC50:  240nM. Assay description: In vitro inhibitory activity against Factor Xa
In DepthDetails ArticlePubMed
TargetNeuropeptide Y receptor type 4(Homo sapiens (Human))
University Of Cincinnati
Curated by ChEMBL
LigandPNGBDBM50185364(CHEMBL2371908 | CHEMBL415187 | Sub[-Tyr-Arg-Leu-Ar...)
Affinity DataEC50:  15nM. Assay description: In vitro inhibitory activity against Factor Xa
In DepthDetails ArticlePubMed