BDBM50185587 7-hydroxy-5-methoxy-4-methyl-6-(3-methylbut-2-enyl)isobenzofuran-1(3H)-one::CHEMBL209723
SMILES [#6]-[#8]-c1c(-[#6])c2-[#6]-[#8]-[#6](=O)-c2c(-[#8])c1-[#6]\[#6]=[#6](/[#6])-[#6]
InChI Key InChIKey=NPMVXPUWUHWDSQ-UHFFFAOYSA-N
Data  1 IC50
  Tab Delimited (TSV)   2D SDfile   Computed 3D by Vconf -m prep SDfile
Find this compound or compounds like it in BindingDB:
Activity Spreadsheet -- Enzyme Inhibition Constant Data from BindingDB
Found 1 hit for monomerid = 50185587
TargetInosine-5'-monophosphate dehydrogenase 2(Homo sapiens (Human))
Gilead Sciences
Curated by ChEMBL
LigandPNGBDBM50185587(7-hydroxy-5-methoxy-4-methyl-6-(3-methylbut-2-enyl...)
Affinity DataIC50:  254nM. Assay description: Inhibition of human IMPDH2
In DepthDetails ArticlePubMed