BDBM50185595 (E)-2-(N-(4-(6-ethyl-4-hydroxy-7-methyl-3-oxo-1,3-dihydroisobenzofuran-5-yl)-2-methylbut-2-enyl)methan-23-ylsulfonamido)ethylphosphonic acid::CHEMBL212620
SMILES CCc1c(C)c2COC(=O)c2c(O)c1C\C=C(/C)CN(CCP(O)(O)=O)S(C)(=O)=O
InChI Key InChIKey=TUSBFZSJFOUWHP-WUXMJOGZSA-N
Data  1 IC50
  Tab Delimited (TSV)   2D SDfile   Computed 3D by Vconf -m prep SDfile
Find this compound or compounds like it in BindingDB:
Activity Spreadsheet -- Enzyme Inhibition Constant Data from BindingDB
Found 1 hit for monomerid = 50185595
TargetInosine-5'-monophosphate dehydrogenase 2(Homo sapiens (Human))
Gilead Sciences
Curated by ChEMBL
LigandPNGBDBM50185595((E)-2-(N-(4-(6-ethyl-4-hydroxy-7-methyl-3-oxo-1,3-...)
Affinity DataIC50:  68nM. Assay description: Inhibition of human IMPDH2
In DepthDetails ArticlePubMed