BDBM50185840 7-hydroxy-9a-(2-hydroxyethyl)-4-methyl-1,2,9,9a-tetrahydrofluoren-3-one::CHEMBL379384
SMILES CC1=C2c3ccc(O)cc3CC2(CCO)CCC1=O
InChI Key InChIKey=YRNYXWIJRRKPKH-UHFFFAOYSA-N
Data  2 IC50
  Tab Delimited (TSV)   2D SDfile   Computed 3D by Vconf -m prep SDfile
Find this compound or compounds like it in BindingDB:
Activity Spreadsheet -- Enzyme Inhibition Constant Data from BindingDB
Found 2 hits for monomerid = 50185840
TargetEstrogen receptor beta(Homo sapiens (Human))
Merck Research Laboratories
Curated by ChEMBL
LigandPNGBDBM50185840(7-hydroxy-9a-(2-hydroxyethyl)-4-methyl-1,2,9,9a-te...)
Affinity DataIC50: >1.00E+4nM. Assay description: Binding affinity to ERbeta by scintillation proximity assay
In DepthDetails ArticlePubMed
TargetEstrogen receptor(Homo sapiens (Human))
Merck Research Laboratories
Curated by ChEMBL
LigandPNGBDBM50185840(7-hydroxy-9a-(2-hydroxyethyl)-4-methyl-1,2,9,9a-te...)
Affinity DataIC50: >1.00E+4nM. Assay description: Binding affinity to ERalpha by scintillation proximity assay
In DepthDetails ArticlePubMed