BDBM50185962 CHEMBL210327::N-(3,4-dichlorophenyl)-N-(3-{4-[(4-fluorobenzoyl)amino]-piperidin-1-yl}propyl)-1-(methylsulfonyl)piperidine-4-carboxamide
SMILES CS(=O)(=O)N1CCC(CC1)C(=O)N(CCCN1CCC(CC1)NC(=O)c1ccc(F)cc1)c1ccc(Cl)c(Cl)c1
InChI Key InChIKey=NTMGUIDGOILDRZ-UHFFFAOYSA-N
Data  1 IC50
  Tab Delimited (TSV)   2D SDfile   Computed 3D by Vconf -m prep SDfile
Find this compound or compounds like it in BindingDB:
Activity Spreadsheet -- Enzyme Inhibition Constant Data from BindingDB
Found 1 hit for monomerid = 50185962
TargetC-C chemokine receptor type 5(Homo sapiens (Human))
Takeda Pharmaceutical
Curated by ChEMBL
LigandPNGBDBM50185962(CHEMBL210327 | N-(3,4-dichlorophenyl)-N-(3-{4-[(4-...)
Affinity DataIC50:  730nM. Assay description: Inhibition of [125I]RANTES binding to human CCR5 expressed in CHO cells
In DepthDetails ArticlePubMed