BDBM50186288 2-(methylsulfonyl)-7-(3-(piperidin-1-yl)propoxy)-1,2,3,4-tetrahydroisoquinoline::CHEMBL208830
SMILES CS(=O)(=O)N1CCc2ccc(OCCCN3CCCCC3)cc2C1
InChI Key InChIKey=ROLRJBPCSPNHSD-UHFFFAOYSA-N
Data  2 KI
  Tab Delimited (TSV)   2D SDfile   Computed 3D by Vconf -m prep SDfile
Find this compound or compounds like it in BindingDB:
Activity Spreadsheet -- Enzyme Inhibition Constant Data from BindingDB
Found 2 hits for monomerid = 50186288
TargetHistamine H3 receptor(Homo sapiens (Human))
Eli Lilly
Curated by ChEMBL
LigandPNGBDBM50186288(2-(methylsulfonyl)-7-(3-(piperidin-1-yl)propoxy)-1...)
Affinity DataKi:  23.8nM. Assay description: Displacement of [3H]N-alpha-methylhistamine from human cloned H3 receptor
In DepthDetails ArticlePubMed
TargetHistamine H3 receptor(Rattus norvegicus (rat))
Eli Lilly
Curated by ChEMBL
LigandPNGBDBM50186288(2-(methylsulfonyl)-7-(3-(piperidin-1-yl)propoxy)-1...)
Affinity DataKi:  74.5nM. Assay description: Displacement of [3H]N-alpha-methylhistamine from rat cloned H3 receptor
In DepthDetails ArticlePubMed