BDBM50186305 2-(phenylsulfonyl)-6-(3-(piperidin-1-yl)propoxy)-1,2,3,4-tetrahydroisoquinoline::CHEMBL210410
SMILES O=S(=O)(N1CCc2cc(OCCCN3CCCCC3)ccc2C1)c1ccccc1
InChI Key InChIKey=HAOWXJHLNMKAFU-UHFFFAOYSA-N
Data  1 KI
  Tab Delimited (TSV)   2D SDfile   Computed 3D by Vconf -m prep SDfile
Find this compound or compounds like it in BindingDB:
Activity Spreadsheet -- Enzyme Inhibition Constant Data from BindingDB
Found 1 hit for monomerid = 50186305
TargetHistamine H3 receptor(Homo sapiens (Human))
Eli Lilly
Curated by ChEMBL
LigandPNGBDBM50186305(2-(phenylsulfonyl)-6-(3-(piperidin-1-yl)propoxy)-1...)
Affinity DataKi:  7.40nM. Assay description: Displacement of [3H]N-alpha-methylhistamine from human cloned H3 receptor
In DepthDetails ArticlePubMed