BDBM50186317 1-ethyl-8-(3-(piperidin-1-yl)propoxy)-1,2,3,4-tetrahydroquinoline::CHEMBL212516
SMILES CCN1CCCc2cccc(OCCCN3CCCCC3)c12
InChI Key InChIKey=WMMFRAYLJTXUQZ-UHFFFAOYSA-N
Data  2 KI
  Tab Delimited (TSV)   2D SDfile   Computed 3D by Vconf -m prep SDfile
Find this compound or compounds like it in BindingDB:
Activity Spreadsheet -- Enzyme Inhibition Constant Data from BindingDB
Found 2 hits for monomerid = 50186317
TargetHistamine H3 receptor(Homo sapiens (Human))
Eli Lilly
Curated by ChEMBL
LigandPNGBDBM50186317(1-ethyl-8-(3-(piperidin-1-yl)propoxy)-1,2,3,4-tetr...)
Affinity DataKi: >300nM. Assay description: Displacement of [3H]N-alpha-methylhistamine from human cloned H3 receptor
In DepthDetails ArticlePubMed
TargetHistamine H3 receptor(Homo sapiens (Human))
Eli Lilly
Curated by ChEMBL
LigandPNGBDBM50186317(1-ethyl-8-(3-(piperidin-1-yl)propoxy)-1,2,3,4-tetr...)
Affinity DataKi:  1.00E+3nM. Assay description: Binding affinity to histamine H3 receptor (unknown origin)
In DepthDetails ArticlePubMed