BDBM501864 US11028067, Example 5
SMILES COc1ccc(c(n1)S(=O)(=O)c1ncccn1)[N+]([O-])=O
InChI Key InChIKey=KEULQAPNVOMUBZ-UHFFFAOYSA-N
Data  2 IC50
  Tab Delimited (TSV)   2D SDfile   Computed 3D by Vconf -m prep SDfile
Find this compound or compounds like it in BindingDB:
Activity Spreadsheet -- Enzyme Inhibition Constant Data from BindingDB
Found 2 hits for monomerid = 501864
TargetGlutathione reductase, mitochondrial(Homo sapiens (Human))
Oblique Therapeutics
US Patent
LigandPNGBDBM501864(US11028067, Example 5)
Affinity DataIC50: >1.00E+8nM. Assay description: Small molecule inhibition of recombinant thioredoxin reductase 1 (TrxR1) and gluthathione reductase (GR) was examined in 96-well plate format. 30 nM ...
Ligand InfoPC cidPC sid
In DepthDetails US Patent
TargetThioredoxin reductase 1, cytoplasmic(Homo sapiens (Human))
Oblique Therapeutics
US Patent
LigandPNGBDBM501864(US11028067, Example 5)
Affinity DataIC50:  10.8nM. Assay description: Small molecule inhibition of recombinant thioredoxin reductase 1 (TrxR1) and gluthathione reductase (GR) was examined in 96-well plate format. 30 nM ...
Ligand InfoPC cidPC sid
In DepthDetails US Patent