BDBM50187162 (S)-N-(3-chlorophenethyl)-4-((3-(6-amino-2-pivalamidohexanoyl)-1,2,4-oxadiazol-5-yl)methyl)benzamide::CHEMBL214136
SMILES CC(C)(C)C(=O)N[C@@H](CCCCN)C(=O)c1noc(Cc2ccc(cc2)C(=O)NCCc2cccc(Cl)c2)n1
InChI Key InChIKey=VMPGWEWOIGDNDK-QHCPKHFHSA-N
Data  1 KI
  Tab Delimited (TSV)   2D SDfile   Computed 3D by Vconf -m prep SDfile
Find this compound or compounds like it in BindingDB:
Activity Spreadsheet -- Enzyme Inhibition Constant Data from BindingDB
Found 1 hit for monomerid = 50187162
TargetDimer of Tryptase beta-2(Homo sapiens (Human))
Celera
Curated by ChEMBL
LigandPNGBDBM50187162((S)-N-(3-chlorophenethyl)-4-((3-(6-amino-2-pivalam...)
Affinity DataKi:  2nM. Assay description: Inhibition of human beta tryptase
In DepthDetails ArticlePubMed