BDBM50187167 CHEMBL211357::N-[(S)-5-amino-1-(5-{4-[2-(3-chloro-phenyl)-ethylcarbamoyl]-benzyl}-[1,2,4]oxadiazole-3-carbonyl)-pentyl]-3,5-difluoro-benzamide
SMILES NCCCC[C@H](NC(=O)c1cc(F)cc(F)c1)C(=O)c1noc(Cc2ccc(cc2)C(=O)NCCc2cccc(Cl)c2)n1
InChI Key InChIKey=QIHKHBGQSKPTOB-SANMLTNESA-N
Data  1 KI
  Tab Delimited (TSV)   2D SDfile   Computed 3D by Vconf -m prep SDfile
Find this compound or compounds like it in BindingDB:
Activity Spreadsheet -- Enzyme Inhibition Constant Data from BindingDB
Found 1 hit for monomerid = 50187167
TargetDimer of Tryptase beta-2(Homo sapiens (Human))
Celera
Curated by ChEMBL
LigandPNGBDBM50187167(CHEMBL211357 | N-[(S)-5-amino-1-(5-{4-[2-(3-chloro...)
Affinity DataKi:  1.5nM. Assay description: Inhibition of human beta tryptase
In DepthDetails ArticlePubMed