BDBM50187181 (S)-benzyl 1-(5-(4-methoxybenzyl)-1,2,4-oxadiazol-3-yl)-6-amino-1-oxohexan-2-ylcarbamate::CHEMBL213698
SMILES COc1ccc(Cc2nc(no2)C(=O)[C@H](CCCCN)NC(=O)OCc2ccccc2)cc1
InChI Key InChIKey=BJXLDDFCVLFRRC-FQEVSTJZSA-N
Data  1 KI
  Tab Delimited (TSV)   2D SDfile   Computed 3D by Vconf -m prep SDfile
Find this compound or compounds like it in BindingDB:
Activity Spreadsheet -- Enzyme Inhibition Constant Data from BindingDB
Found 1 hit for monomerid = 50187181
TargetDimer of Tryptase beta-2(Homo sapiens (Human))
Celera
Curated by ChEMBL
LigandPNGBDBM50187181((S)-benzyl 1-(5-(4-methoxybenzyl)-1,2,4-oxadiazol-...)
Affinity DataKi:  770nM. Assay description: Inhibition of human beta tryptase
In DepthDetails ArticlePubMed