BDBM50187265 (2R,5S)-1-(2-(2,4,4-trimethylpentan-2-ylamino)acetyl)pyrrolidine-2,5-dicarbonitrile::CHEMBL377320
SMILES CC(C)(C)CC(C)(C)NCC(=O)N1[C@@H](CC[C@@H]1C#N)C#N
InChI Key InChIKey=LPQSWHHTZHIQBV-BETUJISGSA-N
Data  1 IC50
  Tab Delimited (TSV)   2D SDfile   Computed 3D by Vconf -m prep SDfile
Find this compound or compounds like it in BindingDB:
Activity Spreadsheet -- Enzyme Inhibition Constant Data from BindingDB
Found 1 hit for monomerid = 50187265
TargetDipeptidyl peptidase 4(Homo sapiens (Human))
Pfizer
Curated by ChEMBL
LigandPNGBDBM50187265((2R,5S)-1-(2-(2,4,4-trimethylpentan-2-ylamino)acet...)
Affinity DataIC50:  208nM. Assay description: Inhibition of human recombinant DPP4
In DepthDetails ArticlePubMed