BDBM50187281 (2R,5S)-1-(2-(1-ethynylcyclohexylamino)acetyl)pyrrolidine-2,5-dicarbonitrile::CHEMBL380870
SMILES O=C(CNC1(CCCCC1)C#C)N1[C@@H](CC[C@@H]1C#N)C#N
InChI Key InChIKey=UUPADPNLDUZSGQ-OKILXGFUSA-N
Data  1 IC50
  Tab Delimited (TSV)   2D SDfile   Computed 3D by Vconf -m prep SDfile
Find this compound or compounds like it in BindingDB:
Activity Spreadsheet -- Enzyme Inhibition Constant Data from BindingDB
Found 1 hit for monomerid = 50187281
TargetDipeptidyl peptidase 4(Homo sapiens (Human))
Pfizer
Curated by ChEMBL
LigandPNGBDBM50187281((2R,5S)-1-(2-(1-ethynylcyclohexylamino)acetyl)pyrr...)
Affinity DataIC50: >3.00E+3nM. Assay description: Inhibition of human recombinant DPP4
In DepthDetails ArticlePubMed