BDBM50187284 (2S,5R)-1-(2-(1-(hydroxymethyl)cyclopentylamino)acetyl)-5-phenylpyrrolidine-2-carbonitrile::CHEMBL210328
SMILES OCC1(CCCC1)NCC(=O)N1[C@@H](CC[C@@H]1c1ccccc1)C#N
InChI Key InChIKey=QITGSVUBMFCQQD-DLBZAZTESA-N
Data  1 IC50
  Tab Delimited (TSV)   2D SDfile   Computed 3D by Vconf -m prep SDfile
Find this compound or compounds like it in BindingDB:
Activity Spreadsheet -- Enzyme Inhibition Constant Data from BindingDB
Found 1 hit for monomerid = 50187284
TargetDipeptidyl peptidase 4(Homo sapiens (Human))
Pfizer
Curated by ChEMBL
LigandPNGBDBM50187284((2S,5R)-1-(2-(1-(hydroxymethyl)cyclopentylamino)ac...)
Affinity DataIC50: >3.00E+4nM. Assay description: Inhibition of human recombinant DPP4
In DepthDetails ArticlePubMed