BDBM50187287 (2R,5S)-1-(2-(1-benzylcyclohexylamino)acetyl)pyrrolidine-2,5-dicarbonitrile::CHEMBL378421
SMILES O=C(CNC1(Cc2ccccc2)CCCCC1)N1[C@@H](CC[C@@H]1C#N)C#N
InChI Key InChIKey=PJVBKIBEIGJKIZ-KDURUIRLSA-N
Data  1 IC50
  Tab Delimited (TSV)   2D SDfile   Computed 3D by Vconf -m prep SDfile
Find this compound or compounds like it in BindingDB:
Activity Spreadsheet -- Enzyme Inhibition Constant Data from BindingDB
Found 1 hit for monomerid = 50187287
TargetDipeptidyl peptidase 4(Homo sapiens (Human))
Pfizer
Curated by ChEMBL
LigandPNGBDBM50187287((2R,5S)-1-(2-(1-benzylcyclohexylamino)acetyl)pyrro...)
Affinity DataIC50: >3.00E+3nM. Assay description: Inhibition of human recombinant DPP4
In DepthDetails ArticlePubMed