BDBM50187290 (2R,5S)-1-(2-(1-(3,3-dimethyl-2-oxobutyl)cyclopentylamino)acetyl)pyrrolidine-2,5-dicarbonitrile::CHEMBL378750
SMILES CC(C)(C)C(=O)CC1(CCCC1)NCC(=O)N1[C@@H](CC[C@@H]1C#N)C#N
InChI Key InChIKey=DXPKEVJIZJQCLD-GASCZTMLSA-N
Data  1 IC50
  Tab Delimited (TSV)   2D SDfile   Computed 3D by Vconf -m prep SDfile
Find this compound or compounds like it in BindingDB:
Activity Spreadsheet -- Enzyme Inhibition Constant Data from BindingDB
Found 1 hit for monomerid = 50187290
TargetDipeptidyl peptidase 4(Homo sapiens (Human))
Pfizer
Curated by ChEMBL
LigandPNGBDBM50187290((2R,5S)-1-(2-(1-(3,3-dimethyl-2-oxobutyl)cyclopent...)
Affinity DataIC50:  1.86E+3nM. Assay description: Inhibition of human recombinant DPP4
In DepthDetails ArticlePubMed