BDBM50187301 (2R,5S)-1-(2-(1-benzylcyclobutylamino)acetyl)pyrrolidine-2,5-dicarbonitrile::CHEMBL209127
SMILES O=C(CNC1(Cc2ccccc2)CCC1)N1[C@@H](CC[C@@H]1C#N)C#N
InChI Key InChIKey=GBMAMEZWHPXWQQ-CALCHBBNSA-N
Data  1 IC50
  Tab Delimited (TSV)   2D SDfile   Computed 3D by Vconf -m prep SDfile
Find this compound or compounds like it in BindingDB:
Activity Spreadsheet -- Enzyme Inhibition Constant Data from BindingDB
Found 1 hit for monomerid = 50187301
TargetDipeptidyl peptidase 4(Homo sapiens (Human))
Pfizer
Curated by ChEMBL
LigandPNGBDBM50187301((2R,5S)-1-(2-(1-benzylcyclobutylamino)acetyl)pyrro...)
Affinity DataIC50:  1.16E+3nM. Assay description: Inhibition of human recombinant DPP4
In DepthDetails ArticlePubMed