BDBM50187486 CHEMBL3827833
SMILES OC(=O)C1C2CC(Sc3ccccc3[N+]([O-])=O)C(Cl)C2c2cccc3C4C=CCC4CN1c23
InChI Key InChIKey=LINVDAPEIYDTLW-UHFFFAOYSA-N
Data  1 KI
  Tab Delimited (TSV)   2D SDfile   Computed 3D by Vconf -m prep SDfile
Find this compound or compounds like it in BindingDB:
Activity Spreadsheet -- Enzyme Inhibition Constant Data from BindingDB
Found 1 hit for monomerid = 50187486
TargetFatty acid-binding protein, adipocyte(Homo sapiens (Human))
Chinese Academy Of Sciences
Curated by ChEMBL
LigandPNGBDBM50187486(CHEMBL3827833)
Affinity DataKi:  3.10E+3nM. Assay description: Displacement of 1,8-ANS from His6-tagged FABP4 (unknown origin) expressed in Escherichia coli BL21(DE3) cells by fluorescence assay
In DepthDetails ArticlePubMed