BDBM50187744 Ac-Cys-Tyr-Lys-Tyr(4-PO3H2)-Tyr::CHEMBL378042
SMILES CC(=O)N[C@@H](CS)C(=O)N[C@@H](Cc1ccc(O)cc1)C(=O)N[C@@H](CCCCN)C(=O)N[C@@H](Cc1ccc(cc1)P(O)(O)=O)C(=O)N[C@@H](Cc1ccc(O)cc1)C(O)=O
InChI Key InChIKey=CLQHWGJWTFUOEF-ZTTXAYQISA-N
Data  1 IC50
  Tab Delimited (TSV)   2D SDfile   Computed 3D by Vconf -m prep SDfile
Find this compound or compounds like it in BindingDB:
Activity Spreadsheet -- Enzyme Inhibition Constant Data from BindingDB
Found 1 hit for monomerid = 50187744
TargetProto-oncogene tyrosine-protein kinase Src(Homo sapiens (Human))
University Of Rhode Island
Curated by ChEMBL
LigandPNGBDBM50187744(Ac-Cys-Tyr-Lys-Tyr(4-PO3H2)-Tyr | CHEMBL378042)
Affinity DataIC50: >7.00E+5nM. Assay description: Inhibition of SRC using polyE4Y as substrate
In DepthDetails ArticlePubMed