BDBM501880 US11028075, Example 13
SMILES CN(C)[C@H]1C[C@H](CC[C@@H]1Nc1cc(F)c(cc1F)S(=O)(=O)Nc1ccncn1)c1cc(cc(c1)C(F)(F)F)C(F)(F)F
InChI Key InChIKey=PQKUEUTWSSBONW-FSJXIACGSA-N
Data  2 IC50
  Tab Delimited (TSV)   2D SDfile   Computed 3D by Vconf -m prep SDfile
Find this compound or compounds like it in BindingDB:
Activity Spreadsheet -- Enzyme Inhibition Constant Data from BindingDB
Found 2 hits for monomerid = 501880
TargetSodium channel protein type 9 subunit alpha(Homo sapiens (Human))
Genentech
US Patent
LigandPNGBDBM501880(US11028075, Example 13)
Affinity DataIC50:  0.652nM. Assay description: The following voltage clamp electrophysiology studies are performed on representative compounds using cells heterologously expressing Nav1.7 or Nav1....
Ligand InfoPC cidPC sid
In DepthDetails US Patent
TargetSodium channel protein type 9 subunit alpha(Homo sapiens (Human))
Genentech
US Patent
LigandPNGBDBM501880(US11028075, Example 13)
Affinity DataIC50:  1.36nM. Assay description: Saturation experiments. A competitive NaV1.7 inhibitor having a methyl group is tritiated. Three tritiums are incorporated in place of methyl hydroge...
Ligand InfoPC cidPC sid
In DepthDetails US Patent