BDBM50188130 (+/-)-(3aS,8aS)-6-bromo-5,8-dimethyl-1,2,3,3a,8,8a-hexahydro-indeno[1,2-c]pyrrole::CHEMBL426695
SMILES CC1[C@@H]2CNC[C@@H]2c2cc(C)c(Br)cc12
InChI Key InChIKey=QMAORUZVLVMNEI-DAPPQGSGSA-N
Data  1 KI
  Tab Delimited (TSV)   2D SDfile   Computed 3D by Vconf -m prep SDfile
Find this compound or compounds like it in BindingDB:
Activity Spreadsheet -- Enzyme Inhibition Constant Data from BindingDB
Found 1 hit for monomerid = 50188130
Target5-hydroxytryptamine receptor 2C(Homo sapiens (Human))
Athersys
Curated by ChEMBL
LigandPNGBDBM50188130((+/-)-(3aS,8aS)-6-bromo-5,8-dimethyl-1,2,3,3a,8,8a...)
Affinity DataKi:  463nM. Assay description: Binding affinity to 5HT2C
In DepthDetails ArticlePubMed