BDBM50188141 (+/-)-(3aS,8aS)-4,8-dimethyl-1,2,3,3a,8,8a-hexahydro-indeno[1,2-c]pyrrole::CHEMBL380246
SMILES CC1[C@@H]2CNC[C@@H]2c2c1cccc2C
InChI Key InChIKey=ZNWTVKSPGXOFTC-WEBCLNCGSA-N
Data  1 KI
  Tab Delimited (TSV)   2D SDfile   Computed 3D by Vconf -m prep SDfile
Find this compound or compounds like it in BindingDB:
Activity Spreadsheet -- Enzyme Inhibition Constant Data from BindingDB
Found 1 hit for monomerid = 50188141
Target5-hydroxytryptamine receptor 2C(Homo sapiens (Human))
Athersys
Curated by ChEMBL
LigandPNGBDBM50188141((+/-)-(3aS,8aS)-4,8-dimethyl-1,2,3,3a,8,8a-hexahyd...)
Affinity DataKi:  1.85E+3nM. Assay description: Binding affinity to 5HT2C
In DepthDetails ArticlePubMed