BDBM50188145 (+/-)-(3aS,8aS)-6-fluoro-8-methyl-1,2,3,3a,8,8a-hexahydro-indeno[1,2-c]pyrrole::CHEMBL211720
SMILES CC1[C@@H]2CNC[C@@H]2c2ccc(F)cc12
InChI Key InChIKey=WNMYWPKNFVTVMC-FRJORHAFSA-N
Data  1 KI
  Tab Delimited (TSV)   2D SDfile   Computed 3D by Vconf -m prep SDfile
Find this compound or compounds like it in BindingDB:
Activity Spreadsheet -- Enzyme Inhibition Constant Data from BindingDB
Found 1 hit for monomerid = 50188145
Target5-hydroxytryptamine receptor 2C(Homo sapiens (Human))
Athersys
Curated by ChEMBL
LigandPNGBDBM50188145((+/-)-(3aS,8aS)-6-fluoro-8-methyl-1,2,3,3a,8,8a-he...)
Affinity DataKi: >1.00E+4nM. Assay description: Binding affinity to 5HT2C
In DepthDetails ArticlePubMed