BDBM50188270 CHEMBL213531::N-ethyl-N-((3-(thiophen-3-yl)-1,4-dihydroindeno[1,2-c]pyrazol-7-yl)methyl)ethanamine
SMILES CCN(CC)Cc1ccc2Cc3c(n[nH]c3-c3ccsc3)-c2c1
InChI Key InChIKey=SSJCJGVOKOWXHB-UHFFFAOYSA-N
Data  1 IC50
  Tab Delimited (TSV)   2D SDfile   Computed 3D by Vconf -m prep SDfile
Find this compound or compounds like it in BindingDB:
Activity Spreadsheet -- Enzyme Inhibition Constant Data from BindingDB
Found 1 hit for monomerid = 50188270
TargetVascular endothelial growth factor receptor 2(Homo sapiens (Human))
Abbott Laboratories
Curated by ChEMBL
LigandPNGBDBM50188270(CHEMBL213531 | N-ethyl-N-((3-(thiophen-3-yl)-1,4-d...)
Affinity DataIC50:  8.24E+5nM. Assay description: Inhibition of VEGF-induced human KDR phosphorylation transfected in NIH3T3 cells by ELISA
In DepthDetails ArticlePubMed