BDBM50188277 6-((4-methylpiperazin-1-yl)methyl)-3-(thiazol-5-yl)-1,4-dihydroindeno[1,2-c]pyrazole::CHEMBL215658
SMILES CN1CCN(Cc2ccc-3c(Cc4c-3n[nH]c4-c3cncs3)c2)CC1
InChI Key InChIKey=MZRCHBSHHUZTFK-UHFFFAOYSA-N
Data  1 IC50
  Tab Delimited (TSV)   2D SDfile   Computed 3D by Vconf -m prep SDfile
Find this compound or compounds like it in BindingDB:
Activity Spreadsheet -- Enzyme Inhibition Constant Data from BindingDB
Found 1 hit for monomerid = 50188277
TargetVascular endothelial growth factor receptor 2(Homo sapiens (Human))
Abbott Laboratories
Curated by ChEMBL
LigandPNGBDBM50188277(6-((4-methylpiperazin-1-yl)methyl)-3-(thiazol-5-yl...)
Affinity DataIC50:  2.84E+3nM. Assay description: Inhibition of VEGF-induced human KDR phosphorylation transfected in NIH3T3 cells by ELISA
In DepthDetails ArticlePubMed