BDBM50188406 CHEMBL207745::N-(2-[5-methoxy-1-methyl-1H-indol-3-yl]-2-methylpropyl)butanamide
SMILES CCCC(=O)NCC(C)(C)c1cn(C)c2ccc(OC)cc12
InChI Key InChIKey=NZWXLQGBITVFAR-UHFFFAOYSA-N
Data  2 KI
  Tab Delimited (TSV)   2D SDfile   Computed 3D by Vconf -m prep SDfile
Find this compound or compounds like it in BindingDB:
Activity Spreadsheet -- Enzyme Inhibition Constant Data from BindingDB
Found 2 hits for monomerid = 50188406
TargetMelatonin receptor type 1B(Homo sapiens (Human))
University Of Athens
Curated by ChEMBL
LigandPNGBDBM50188406(CHEMBL207745 | N-(2-[5-methoxy-1-methyl-1H-indol-3...)
Affinity DataKi:  0.740nM. Assay description: Displacement of 2-[125I]iodomelatonin from human recombinant MT2 receptor expressed in NIH3T3 cells
In DepthDetails ArticlePubMed
TargetMelatonin receptor type 1A(Homo sapiens (Human))
University Of Athens
Curated by ChEMBL
LigandPNGBDBM50188406(CHEMBL207745 | N-(2-[5-methoxy-1-methyl-1H-indol-3...)
Affinity DataKi:  8.51nM. Assay description: Displacement of 2-[125I]iodomelatonin from human recombinant MT1 receptor expressed in NIH3T3 cells
In DepthDetails ArticlePubMed