BDBM50188407 CHEMBL382050::N-(2-[5-methoxy-1-methyl-1H-indol-3-yl]-2,2-trimethyleneethyl)cyclobutanecarboxamide
SMILES COc1ccc2n(C)cc(c2c1)C1(CNC(=O)C2CCC2)CCC1
InChI Key InChIKey=GKMMKPYQCIXAQV-UHFFFAOYSA-N
Data  2 KI
  Tab Delimited (TSV)   2D SDfile   Computed 3D by Vconf -m prep SDfile
Find this compound or compounds like it in BindingDB:
Activity Spreadsheet -- Enzyme Inhibition Constant Data from BindingDB
Found 2 hits for monomerid = 50188407
TargetMelatonin receptor type 1A(Homo sapiens (Human))
University Of Athens
Curated by ChEMBL
LigandPNGBDBM50188407(CHEMBL382050 | N-(2-[5-methoxy-1-methyl-1H-indol-3...)
Affinity DataKi:  714nM. Assay description: Displacement of 2-[125I]iodomelatonin from human recombinant MT1 receptor expressed in NIH3T3 cells
In DepthDetails ArticlePubMed
TargetMelatonin receptor type 1B(Homo sapiens (Human))
University Of Athens
Curated by ChEMBL
LigandPNGBDBM50188407(CHEMBL382050 | N-(2-[5-methoxy-1-methyl-1H-indol-3...)
Affinity DataKi:  3.77E+3nM. Assay description: Displacement of 2-[125I]iodomelatonin from human recombinant MT2 receptor expressed in NIH3T3 cells
In DepthDetails ArticlePubMed