BDBM50188409 CHEMBL426861::N-(2-[1-methyl-1H-indol-3-yl]-2,2-trimethylene-ethyl)propaneamide
SMILES CCC(=O)NCC1(CCC1)c1cn(C)c2ccc(O)cc12
InChI Key InChIKey=QYSQJWAHRVRDAH-UHFFFAOYSA-N
Data  2 KI
  Tab Delimited (TSV)   2D SDfile   Computed 3D by Vconf -m prep SDfile
Find this compound or compounds like it in BindingDB:
Activity Spreadsheet -- Enzyme Inhibition Constant Data from BindingDB
Found 2 hits for monomerid = 50188409
TargetMelatonin receptor type 1B(Homo sapiens (Human))
University Of Athens
Curated by ChEMBL
LigandPNGBDBM50188409(CHEMBL426861 | N-(2-[1-methyl-1H-indol-3-yl]-2,2-t...)
Affinity DataKi:  1.05E+3nM. Assay description: Displacement of 2-[125I]iodomelatonin from human recombinant MT2 receptor expressed in NIH3T3 cells
In DepthDetails ArticlePubMed
TargetMelatonin receptor type 1A(Homo sapiens (Human))
University Of Athens
Curated by ChEMBL
LigandPNGBDBM50188409(CHEMBL426861 | N-(2-[1-methyl-1H-indol-3-yl]-2,2-t...)
Affinity DataKi:  1.51E+3nM. Assay description: Displacement of 2-[125I]iodomelatonin from human recombinant MT1 receptor expressed in NIH3T3 cells
In DepthDetails ArticlePubMed