BDBM50188413 CHEMBL206790::N-(2-[5-methoxy-1H-indol-3-yl]-2,2-trimethyleneethyl)cyclopropanecarboxamide
SMILES COc1ccc2[nH]cc(c2c1)C1(CNC(=O)C2CC2)CCC1
InChI Key InChIKey=VHIXTIIIAWEOIG-UHFFFAOYSA-N
Data  2 KI
  Tab Delimited (TSV)   2D SDfile   Computed 3D by Vconf -m prep SDfile
Find this compound or compounds like it in BindingDB:
Activity Spreadsheet -- Enzyme Inhibition Constant Data from BindingDB
Found 2 hits for monomerid = 50188413
TargetMelatonin receptor type 1B(Homo sapiens (Human))
University Of Athens
Curated by ChEMBL
LigandPNGBDBM50188413(CHEMBL206790 | N-(2-[5-methoxy-1H-indol-3-yl]-2,2-...)
Affinity DataKi:  28.9nM. Assay description: Displacement of 2-[125I]iodomelatonin from human recombinant MT2 receptor expressed in NIH3T3 cells
In DepthDetails ArticlePubMed
TargetMelatonin receptor type 1A(Homo sapiens (Human))
University Of Athens
Curated by ChEMBL
LigandPNGBDBM50188413(CHEMBL206790 | N-(2-[5-methoxy-1H-indol-3-yl]-2,2-...)
Affinity DataKi:  57.8nM. Assay description: Displacement of 2-[125I]iodomelatonin from human recombinant MT1 receptor expressed in NIH3T3 cells
In DepthDetails ArticlePubMed