BDBM50188421 CHEMBL379504::N-(2-[1-methyl-1H-indol-3-yl]-2,2-trimethylene-ethyl)acetamide
SMILES CC(=O)NCC1(CCC1)c1cn(C)c2ccc(O)cc12
InChI Key InChIKey=TWMBBSVWNVQTEL-UHFFFAOYSA-N
Data  2 KI
  Tab Delimited (TSV)   2D SDfile   Computed 3D by Vconf -m prep SDfile
Find this compound or compounds like it in BindingDB:
Activity Spreadsheet -- Enzyme Inhibition Constant Data from BindingDB
Found 2 hits for monomerid = 50188421
TargetMelatonin receptor type 1B(Homo sapiens (Human))
University Of Athens
Curated by ChEMBL
LigandPNGBDBM50188421(CHEMBL379504 | N-(2-[1-methyl-1H-indol-3-yl]-2,2-t...)
Affinity DataKi:  1.26E+3nM. Assay description: Displacement of 2-[125I]iodomelatonin from human recombinant MT2 receptor expressed in NIH3T3 cells
In DepthDetails ArticlePubMed
TargetMelatonin receptor type 1A(Homo sapiens (Human))
University Of Athens
Curated by ChEMBL
LigandPNGBDBM50188421(CHEMBL379504 | N-(2-[1-methyl-1H-indol-3-yl]-2,2-t...)
Affinity DataKi:  2.19E+3nM. Assay description: Displacement of 2-[125I]iodomelatonin from human recombinant MT1 receptor expressed in NIH3T3 cells
In DepthDetails ArticlePubMed