BDBM50188884 CHEMBL212441::rac-8-[1-(4-fluoro-phenyl)-cyclohexyl]-4-p-tolyl-2,8-diaza-spiro[4.5]decan-1-one
SMILES Cc1ccc(cc1)C1CNC(=O)C11CCN(CC1)C1(CCCCC1)c1ccc(F)cc1
InChI Key InChIKey=VCPCEUAIERDWJJ-UHFFFAOYSA-N
Data  1 EC50
  Tab Delimited (TSV)   2D SDfile   Computed 3D by Vconf -m prep SDfile
Find this compound or compounds like it in BindingDB:
Activity Spreadsheet -- Enzyme Inhibition Constant Data from BindingDB
Found 1 hit for monomerid = 50188884
TargetSodium- and chloride-dependent glycine transporter 1(Homo sapiens (Human))
F. Hoffmann-La Roche
Curated by ChEMBL
LigandPNGBDBM50188884(CHEMBL212441 | rac-8-[1-(4-fluoro-phenyl)-cyclohex...)
Affinity DataEC50:  73nM. Assay description: Inhibition of [3H]glycine uptake at GlyT1
In DepthDetails ArticlePubMed