BDBM50188920 CHEMBL377860::N-(2-(dimethylamino)ethyl)-5-(2-(methylamino)pyrimidin-4-yl)thiophene-2-carboxamide
SMILES CNc1nccc(n1)-c1ccc(s1)C(=O)NCCN(C)C
InChI Key InChIKey=NMHPRSZNSIRZJD-UHFFFAOYSA-N
Data  1 IC50
  Tab Delimited (TSV)   2D SDfile   Computed 3D by Vconf -m prep SDfile
Find this compound or compounds like it in BindingDB:
Activity Spreadsheet -- Enzyme Inhibition Constant Data from BindingDB
Found 1 hit for monomerid = 50188920
TargetRAC-gamma serine/threonine-protein kinase(Homo sapiens (Human))
Chiron
Curated by ChEMBL
LigandPNGBDBM50188920(CHEMBL377860 | N-(2-(dimethylamino)ethyl)-5-(2-(me...)
Affinity DataIC50:  7.00E+3nM. Assay description: Inhibition of AKT3 in presence of 0.2 uM ATP
In DepthDetails ArticlePubMed