BDBM50188934 CHEMBL213178::N-(3-(4-fluorophenyl)propyl)-5-(2-(methylamino)pyrimidin-4-yl)thiophene-2-carboxamide
SMILES CNc1nccc(n1)-c1ccc(s1)C(=O)NCCCc1ccc(F)cc1
InChI Key InChIKey=ATXIGCMNGRDMPV-UHFFFAOYSA-N
Data  1 IC50
  Tab Delimited (TSV)   2D SDfile   Computed 3D by Vconf -m prep SDfile
Find this compound or compounds like it in BindingDB:
Activity Spreadsheet -- Enzyme Inhibition Constant Data from BindingDB
Found 1 hit for monomerid = 50188934
TargetRAC-gamma serine/threonine-protein kinase(Homo sapiens (Human))
Chiron
Curated by ChEMBL
LigandPNGBDBM50188934(CHEMBL213178 | N-(3-(4-fluorophenyl)propyl)-5-(2-(...)
Affinity DataIC50:  1.80E+4nM. Assay description: Inhibition of AKT3 in presence of 0.2 uM ATP
In DepthDetails ArticlePubMed