BDBM50189128 CHEMBL212250::N-(4-(3-fluorobenzyloxy)-3-chlorophenyl)-6-(5-((2-(phenylsulfonyl)ethoxy)methyl)furan-2-yl)quinazolin-4-amine
SMILES Fc1cccc(COc2ccc(Nc3ncnc4ccc(cc34)-c3ccc(COCCS(=O)(=O)c4ccccc4)o3)cc2Cl)c1
InChI Key InChIKey=JLBVWHHVKVXOOR-UHFFFAOYSA-N
Data  2 IC50
  Tab Delimited (TSV)   2D SDfile   Computed 3D by Vconf -m prep SDfile
Find this compound or compounds like it in BindingDB:
Activity Spreadsheet -- Enzyme Inhibition Constant Data from BindingDB
Found 2 hits for monomerid = 50189128
TargetEpidermal growth factor receptor(Homo sapiens (Human))
Glaxosmithkline
Curated by ChEMBL
LigandPNGBDBM50189128(CHEMBL212250 | N-(4-(3-fluorobenzyloxy)-3-chloroph...)
Affinity DataIC50:  25nM. Assay description: Inhibition of ErbB1
In DepthDetails ArticlePubMed
TargetReceptor tyrosine-protein kinase erbB-2(Homo sapiens (Human))
Glaxosmithkline
Curated by ChEMBL
LigandPNGBDBM50189128(CHEMBL212250 | N-(4-(3-fluorobenzyloxy)-3-chloroph...)
Affinity DataIC50:  28nM. Assay description: Inhibition of ErbB2
In DepthDetails ArticlePubMed