BDBM50189847 2-[4-(2-methoxyphenyl)piperazin-1-ylmethyl]-6-methyl-8-(pyrazol-1-yl)imidazo[1,2-a]pyridine::CHEMBL210551
SMILES COc1ccccc1N1CCN(Cc2cn3cc(C)cc(-n4cccn4)c3n2)CC1
InChI Key InChIKey=CAVSFHXWRJHLEI-UHFFFAOYSA-N
Data  5 KI
  Tab Delimited (TSV)   2D SDfile   Computed 3D by Vconf -m prep SDfile
Find this compound or compounds like it in BindingDB:
Activity Spreadsheet -- Enzyme Inhibition Constant Data from BindingDB
Found 5 hits for monomerid = 50189847
TargetD(4) dopamine receptor(Homo sapiens (Human))
Laboratoire De Chimie Th�Rapeutique
Curated by ChEMBL
LigandPNGBDBM50189847(2-[4-(2-methoxyphenyl)piperazin-1-ylmethyl]-6-meth...)
Affinity DataKi:  1.60nM. Assay description: Displacement of [3H]spiperone from human dopamine receptor D4.4 in CHO cell membrane
In DepthDetails ArticlePubMed
TargetD(2) dopamine receptor(Homo sapiens (Human))
Laboratoire De Chimie Th�Rapeutique
Curated by ChEMBL
LigandPNGBDBM50189847(2-[4-(2-methoxyphenyl)piperazin-1-ylmethyl]-6-meth...)
Affinity DataKi:  280nM. Assay description: Displacement of [3H]spiperone from human dopamine receptor D2(short) in CHO cell membrane
In DepthDetails ArticlePubMed
TargetD(2) dopamine receptor(Homo sapiens (Human))
Laboratoire De Chimie Th�Rapeutique
Curated by ChEMBL
LigandPNGBDBM50189847(2-[4-(2-methoxyphenyl)piperazin-1-ylmethyl]-6-meth...)
Affinity DataKi:  530nM. Assay description: Displacement of [3H]spiperone from human dopamine receptor D2(long) in CHO cell membrane
In DepthDetails ArticlePubMed
TargetD(3) dopamine receptor(Homo sapiens (Human))
Laboratoire De Chimie Th�Rapeutique
Curated by ChEMBL
LigandPNGBDBM50189847(2-[4-(2-methoxyphenyl)piperazin-1-ylmethyl]-6-meth...)
Affinity DataKi:  2.40E+3nM. Assay description: Displacement of [3H]spiperone from human dopamine receptor D3 in CHO cell membrane
In DepthDetails ArticlePubMed
TargetD(1A) dopamine receptor(Sus scrofa)
Laboratoire De Chimie Th�Rapeutique
Curated by ChEMBL
LigandPNGBDBM50189847(2-[4-(2-methoxyphenyl)piperazin-1-ylmethyl]-6-meth...)
Affinity DataKi:  8.70E+3nM. Assay description: Displacement of [3H]SCH 23990 from dopamine receptor D1 in porcine striatal membrane
In DepthDetails ArticlePubMed