BDBM50190443 1-[8-(2-benzyloxy-ethyl)-2-furan-2-yl-8H-pyrazolo[4,3-e][1,2,4]triazolo[1,5-c]pyrimidin-5-yl]-3-pyridin-4-yl-urea::CHEMBL377248
SMILES O=C(Nc1ccncc1)Nc1nc2nn(CCOCc3ccccc3)cc2c2nc(nn12)-c1ccco1
InChI Key InChIKey=KEOFEPBQPNRHDK-UHFFFAOYSA-N
Data  4 KI
  Tab Delimited (TSV)   2D SDfile   Computed 3D by Vconf -m prep SDfile
Find this compound or compounds like it in BindingDB:
Activity Spreadsheet -- Enzyme Inhibition Constant Data from BindingDB
Found 4 hits for monomerid = 50190443
TargetAdenosine receptor A3(Homo sapiens (Human))
Università
Curated by ChEMBL
LigandPNGBDBM50190443(1-[8-(2-benzyloxy-ethyl)-2-furan-2-yl-8H-pyrazolo[...)
Affinity DataKi:  27nM. Assay description: Displacement of [3H]MRE 3008F20 from human adenosine A3 receptor expressed in CHO cells
In DepthDetails ArticlePubMed
TargetAdenosine receptor A2b(Homo sapiens (Human))
Università
Curated by ChEMBL
LigandPNGBDBM50190443(1-[8-(2-benzyloxy-ethyl)-2-furan-2-yl-8H-pyrazolo[...)
Affinity DataKi: >1.00E+3nM. Assay description: Displacement of [3H]MRE 2029F20 from human adenosine A2B receptor expressed in CHO cells
In DepthDetails ArticlePubMed
TargetAdenosine receptor A2a(Homo sapiens (Human))
Università
Curated by ChEMBL
LigandPNGBDBM50190443(1-[8-(2-benzyloxy-ethyl)-2-furan-2-yl-8H-pyrazolo[...)
Affinity DataKi: >1.00E+3nM. Assay description: Displacement of [3H]ZM241385 from human adenosine A2A receptor expressed in CHO cells
In DepthDetails ArticlePubMed
TargetAdenosine receptor A1(Homo sapiens (Human))
Università
Curated by ChEMBL
LigandPNGBDBM50190443(1-[8-(2-benzyloxy-ethyl)-2-furan-2-yl-8H-pyrazolo[...)
Affinity DataKi: >1.00E+3nM. Assay description: Displacement of [3H]DPCPX from human adenosine A1 receptor expressed in CHO cells
In DepthDetails ArticlePubMed