BDBM50190464 1-(3,5-diamino-2-chloropyrazine-6-carbonyl)-3-(5-(4-hydroxyphenyl)pentyl)guanidine::CHEMBL211221
SMILES NC(NC(=O)c1nc(Cl)c(N)nc1N)=NCCCCCc1ccc(O)cc1
InChI Key InChIKey=AFHJQBXQWMBTAO-UHFFFAOYSA-N
Data  1 IC50
  Tab Delimited (TSV)   2D SDfile   Computed 3D by Vconf -m prep SDfile
Find this compound or compounds like it in BindingDB:
Activity Spreadsheet -- Enzyme Inhibition Constant Data from BindingDB
Found 1 hit for monomerid = 50190464
TargetAmiloride-sensitive sodium channel subunit alpha(Homo sapiens (Human))
Parion Sciences
Curated by ChEMBL
LigandPNGBDBM50190464(1-(3,5-diamino-2-chloropyrazine-6-carbonyl)-3-(5-(...)
Affinity DataIC50:  64nM. Assay description: Inhibition of dog bronchi prototypical epithelial sodium channel by electrophysiological assay
In DepthDetails ArticlePubMed