BDBM50190993 1-(4-(2-((S)-1-amino-3-methylbutyl)-4-(trifluoromethyl)phenyl)piperazin-1-yl)-3-(2,4-dimethylphenyl)-2-methylpropan-1-one::CHEMBL386707
SMILES CC(C)C[C@H](N)c1cc(ccc1N1CCN(CC1)C(=O)C(C)Cc1ccc(C)cc1C)C(F)(F)F
InChI Key InChIKey=WQWYZEABOSKYSV-QBGQUKIHSA-N
Data  1 KI
  Tab Delimited (TSV)   2D SDfile   Computed 3D by Vconf -m prep SDfile
Find this compound or compounds like it in BindingDB:
Activity Spreadsheet -- Enzyme Inhibition Constant Data from BindingDB
Found 1 hit for monomerid = 50190993
TargetMelanocortin receptor 4(Homo sapiens (Human))
Neurocrine Biosciences
Curated by ChEMBL
LigandPNGBDBM50190993(1-(4-(2-((S)-1-amino-3-methylbutyl)-4-(trifluorome...)
Affinity DataKi:  92nM. Assay description: Displacement of [125I]NDP-MSH from human MC4R stably expressed in HEK293 cells
In DepthDetails ArticlePubMed