BDBM50190995 1-(4-(2-((S)-1-amino-3-methylbutyl)-4-(trifluoromethyl)phenyl)piperazin-1-yl)-3-(4-chloro-3-methoxyphenyl)-2-methylpropan-1-one::CHEMBL378913
SMILES COc1cc(CC(C)C(=O)N2CCN(CC2)c2ccc(cc2[C@@H](N)CC(C)C)C(F)(F)F)ccc1Cl
InChI Key InChIKey=YIUVYPLGMPCBAC-IMMUGOHXSA-N
Data  1 KI
  Tab Delimited (TSV)   2D SDfile   Computed 3D by Vconf -m prep SDfile
Find this compound or compounds like it in BindingDB:
Activity Spreadsheet -- Enzyme Inhibition Constant Data from BindingDB
Found 1 hit for monomerid = 50190995
TargetMelanocortin receptor 4(Homo sapiens (Human))
Neurocrine Biosciences
Curated by ChEMBL
LigandPNGBDBM50190995(1-(4-(2-((S)-1-amino-3-methylbutyl)-4-(trifluorome...)
Affinity DataKi:  230nM. Assay description: Displacement of [125I]NDP-MSH from human MC4R stably expressed in HEK293 cells
In DepthDetails ArticlePubMed