BDBM50191007 (S)-1-(4-(2-(1-amino-3-methylbutyl)-4-(trifluoromethyl)phenyl)piperazin-1-yl)-2-(4-nitrophenoxy)ethanone::CHEMBL215290
SMILES CC(C)C[C@H](N)c1cc(ccc1N1CCN(CC1)C(=O)COc1ccc(cc1)[N+]([O-])=O)C(F)(F)F
InChI Key InChIKey=VLWPPHHWJYPARM-NRFANRHFSA-N
Data  1 KI
  Tab Delimited (TSV)   2D SDfile   Computed 3D by Vconf -m prep SDfile
Find this compound or compounds like it in BindingDB:
Activity Spreadsheet -- Enzyme Inhibition Constant Data from BindingDB
Found 1 hit for monomerid = 50191007
TargetMelanocortin receptor 4(Homo sapiens (Human))
Neurocrine Biosciences
Curated by ChEMBL
LigandPNGBDBM50191007((S)-1-(4-(2-(1-amino-3-methylbutyl)-4-(trifluorome...)
Affinity DataKi:  3.10E+3nM. Assay description: Displacement of [125I]NDP-MSH from human MC4R stably expressed in HEK293 cells
In DepthDetails ArticlePubMed