BDBM50191009 (S)-1-(4-(2-(1-amino-3-methylbutyl)-4-(trifluoromethyl)phenyl)piperazin-1-yl)-4-(4-chlorophenyl)butane-1,4-dione::CHEMBL380018
SMILES CC(C)C[C@H](N)c1cc(ccc1N1CCN(CC1)C(=O)CCC(=O)c1ccc(Cl)cc1)C(F)(F)F
InChI Key InChIKey=MBUOVFVHMFPNRZ-QFIPXVFZSA-N
Data  1 KI
  Tab Delimited (TSV)   2D SDfile   Computed 3D by Vconf -m prep SDfile
Find this compound or compounds like it in BindingDB:
Activity Spreadsheet -- Enzyme Inhibition Constant Data from BindingDB
Found 1 hit for monomerid = 50191009
TargetMelanocortin receptor 4(Homo sapiens (Human))
Neurocrine Biosciences
Curated by ChEMBL
LigandPNGBDBM50191009((S)-1-(4-(2-(1-amino-3-methylbutyl)-4-(trifluorome...)
Affinity DataKi:  820nM. Assay description: Displacement of [125I]NDP-MSH from human MC4R stably expressed in HEK293 cells
In DepthDetails ArticlePubMed