BDBM50191013 (R)-1-(4-(2-((S)-1-amino-3-methylbutyl)-4-methylphenyl)piperazin-1-yl)-3-(4-chloro-2-methoxyphenyl)-2-methylpropan-1-one::CHEMBL214886
SMILES COc1cc(Cl)ccc1C[C@@H](C)C(=O)N1CCN(CC1)c1ccc(C)cc1[C@@H](N)CC(C)C
InChI Key InChIKey=OXCSYBCGVPSTJH-YKSBVNFPSA-N
Data  1 KI
  Tab Delimited (TSV)   2D SDfile   Computed 3D by Vconf -m prep SDfile
Find this compound or compounds like it in BindingDB:
Activity Spreadsheet -- Enzyme Inhibition Constant Data from BindingDB
Found 1 hit for monomerid = 50191013
TargetMelanocortin receptor 4(Homo sapiens (Human))
Neurocrine Biosciences
Curated by ChEMBL
LigandPNGBDBM50191013((R)-1-(4-(2-((S)-1-amino-3-methylbutyl)-4-methylph...)
Affinity DataKi:  8.10nM. Assay description: Displacement of [125I]NDP-MSH from human MC4R stably expressed in HEK293 cells
In DepthDetails ArticlePubMed