BDBM50191017 (R)-1-(4-(2-((S)-1-amino-3-methylbutyl)-4-(trifluoromethyl)phenyl)piperazin-1-yl)-3-(4-chlorophenyl)-2-methylpropan-1-one::CHEMBL425962
SMILES CC(C)C[C@H](N)c1cc(ccc1N1CCN(CC1)C(=O)[C@H](C)Cc1ccc(Cl)cc1)C(F)(F)F
InChI Key InChIKey=TUVAAUULBWCGLQ-JPYJTQIMSA-N
Data  3 KI
  Tab Delimited (TSV)   2D SDfile   Computed 3D by Vconf -m prep SDfile
Find this compound or compounds like it in BindingDB:
Activity Spreadsheet -- Enzyme Inhibition Constant Data from BindingDB
Found 3 hits for monomerid = 50191017
TargetMelanocortin receptor 4(Homo sapiens (Human))
Neurocrine Biosciences
Curated by ChEMBL
LigandPNGBDBM50191017((R)-1-(4-(2-((S)-1-amino-3-methylbutyl)-4-(trifluo...)
Affinity DataKi:  31nM. Assay description: Displacement of [125I]NDP-MSH from human MC4R stably expressed in HEK293 cells
In DepthDetails ArticlePubMed
TargetMelanocortin receptor 4(Homo sapiens (Human))
Neurocrine Biosciences
Curated by ChEMBL
LigandPNGBDBM50191017((R)-1-(4-(2-((S)-1-amino-3-methylbutyl)-4-(trifluo...)
Affinity DataKi:  31nM. Assay description: Binding affinity to MC4 receptor
In DepthDetails ArticlePubMed
TargetMelanocortin receptor 4(Homo sapiens (Human))
Neurocrine Biosciences
Curated by ChEMBL
LigandPNGBDBM50191017((R)-1-(4-(2-((S)-1-amino-3-methylbutyl)-4-(trifluo...)
Affinity DataKi:  31nM. Assay description: Binding affinity at human MC4R
In DepthDetails ArticlePubMed