BDBM50191125 CHEMBL214875::N-methyl-N-(3-(6-methylpyridin-2-yl)prop-2-ynyl)benzenamine
SMILES CN(CC#Cc1cccc(C)n1)c1ccccc1
InChI Key InChIKey=UFBHHFPCEQVCFD-UHFFFAOYSA-N
Data  1 IC50
  Tab Delimited (TSV)   2D SDfile   Computed 3D by Vconf -m prep SDfile
Find this compound or compounds like it in BindingDB:
Activity Spreadsheet -- Enzyme Inhibition Constant Data from BindingDB
Found 1 hit for monomerid = 50191125
TargetMetabotropic glutamate receptor 5(Homo sapiens (Human))
Astrazeneca R&D MöLndal
Curated by ChEMBL
LigandPNGBDBM50191125(CHEMBL214875 | N-methyl-N-(3-(6-methylpyridin-2-yl...)
Affinity DataIC50:  6.73E+3nM. Assay description: Activity at human mGluR5d assessed as inhibition of glutamate-induced calcium influx by FLIPR assay
In DepthDetails ArticlePubMed