BDBM501913 US11028075, Example 46
SMILES Oc1cc(c(F)cc1N[C@H]1CC[C@@H](C[C@@H]1N1CCCC1)c1cccc(c1)C(F)(F)F)S(=O)(=O)Nc1ccncn1
InChI Key InChIKey=HDVCTEOPFUWACL-HARLFGEKSA-N
Data  2 IC50
  Tab Delimited (TSV)   2D SDfile   Computed 3D by Vconf -m prep SDfile
Find this compound or compounds like it in BindingDB:
Activity Spreadsheet -- Enzyme Inhibition Constant Data from BindingDB
Found 2 hits for monomerid = 501913
TargetSodium channel protein type 9 subunit alpha(Homo sapiens (Human))
Genentech
US Patent
LigandPNGBDBM501913(US11028075, Example 46)
Affinity DataIC50:  24.5nM. Assay description: Saturation experiments. A competitive NaV1.7 inhibitor having a methyl group is tritiated. Three tritiums are incorporated in place of methyl hydroge...
Ligand InfoPC cidPC sid
In DepthDetails US Patent
TargetSodium channel protein type 9 subunit alpha(Homo sapiens (Human))
Genentech
US Patent
LigandPNGBDBM501913(US11028075, Example 46)
Affinity DataIC50:  1.90nM. Assay description: The following voltage clamp electrophysiology studies are performed on representative compounds using cells heterologously expressing Nav1.7 or Nav1....
Ligand InfoPC cidPC sid
In DepthDetails US Patent