BDBM50191565 (S)-2-acetamido-N-((R)-1-((2R,4S)-2-(3-guanidinopropyl)-4-(naphthalen-2-ylmethoxy)pyrrolidin-1-yl)-1-oxo-3-phenylpropan-2-yl)-3-(1H-imidazol-4-)propanamide::CHEMBL213747
SMILES CC(=O)N[C@@H](Cc1cnc[nH]1)C(=O)N[C@H](Cc1ccccc1)C(=O)N1C[C@H](C[C@H]1CCCN=C(N)N)OCc1ccc2ccccc2c1
InChI Key InChIKey=NSMUITYTUDRYSP-JDIHBLRXSA-N
Data  3 KI  3 EC50
  Tab Delimited (TSV)   2D SDfile   Computed 3D by Vconf -m prep SDfile
Find this compound or compounds like it in BindingDB:
Activity Spreadsheet -- Enzyme Inhibition Constant Data from BindingDB
Found 6 hits for monomerid = 50191565
TargetMelanocortin receptor 4(Homo sapiens (Human))
Procter & Gamble Pharmaceuticals
Curated by ChEMBL
LigandPNGBDBM50191565((S)-2-acetamido-N-((R)-1-((2R,4S)-2-(3-guanidinopr...)
Affinity DataKi:  14nM. Assay description: Displacement of europium labeled NDP-alpha-MSH from human MC4R expressed in HEK293 cells
In DepthDetails ArticlePubMed
TargetMelanocortin receptor 3(Homo sapiens (Human))
Procter & Gamble Pharmaceuticals
Curated by ChEMBL
LigandPNGBDBM50191565((S)-2-acetamido-N-((R)-1-((2R,4S)-2-(3-guanidinopr...)
Affinity DataKi:  1.96E+3nM. Assay description: Displacement of europium labeled NDP-alpha-MSH from human MC3R expressed in HEK293 cells
In DepthDetails ArticlePubMed
TargetMelanocyte-stimulating hormone receptor(Homo sapiens (Human))
Procter & Gamble Pharmaceuticals
Curated by ChEMBL
LigandPNGBDBM50191565((S)-2-acetamido-N-((R)-1-((2R,4S)-2-(3-guanidinopr...)
Affinity DataKi:  2.97E+3nM. Assay description: Displacement of europium labeled NDP-alpha-MSH from human MC1R expressed in HEK293 cells
In DepthDetails ArticlePubMed
TargetMelanocortin receptor 3(Homo sapiens (Human))
Procter & Gamble Pharmaceuticals
Curated by ChEMBL
LigandPNGBDBM50191565((S)-2-acetamido-N-((R)-1-((2R,4S)-2-(3-guanidinopr...)
Affinity DataEC50:  1.13E+3nM. Assay description: Agonist activity at human MC3R transfected in HEK293 cells
In DepthDetails ArticlePubMed
TargetMelanocyte-stimulating hormone receptor(Homo sapiens (Human))
Procter & Gamble Pharmaceuticals
Curated by ChEMBL
LigandPNGBDBM50191565((S)-2-acetamido-N-((R)-1-((2R,4S)-2-(3-guanidinopr...)
Affinity DataEC50:  1.22E+3nM. Assay description: Agonist activity at human MC1R transfected in HEK293 cells
In DepthDetails ArticlePubMed
TargetMelanocortin receptor 4(Homo sapiens (Human))
Procter & Gamble Pharmaceuticals
Curated by ChEMBL
LigandPNGBDBM50191565((S)-2-acetamido-N-((R)-1-((2R,4S)-2-(3-guanidinopr...)
Affinity DataEC50:  9nM. Assay description: Agonist activity at human MC4R transfected in HEK293 cells
In DepthDetails ArticlePubMed