BDBM50191835 4-ethoxy-6-(4-(4-methyl-1H-imidazol-5-yl)piperidin-1-yl)-5-phenylpyrimidine::CHEMBL211922
SMILES CCOc1ncnc(N2CCC(CC2)c2[nH]cnc2C)c1-c1ccccc1
InChI Key InChIKey=XVJHCYVTUCYGCH-UHFFFAOYSA-N
Data  1 IC50
  Tab Delimited (TSV)   2D SDfile   Computed 3D by Vconf -m prep SDfile
Find this compound or compounds like it in BindingDB:
Activity Spreadsheet -- Enzyme Inhibition Constant Data from BindingDB
Found 1 hit for monomerid = 50191835
TargetSodium/hydrogen exchanger 1(Homo sapiens (Human))
Pharmaceutical Research Institute
Curated by ChEMBL
LigandPNGBDBM50191835(4-ethoxy-6-(4-(4-methyl-1H-imidazol-5-yl)piperidin...)
Affinity DataIC50:  820nM. Assay description: Inhibition of human NHE1 expressed in Ap1 cell line
In DepthDetails ArticlePubMed