BDBM50191847 5-(3-chloro-4-fluorophenyl)-4-(4-(4-methyl-1H-imidazol-5-yl)piperidin-1-yl)pyrimidine::CHEMBL380382
SMILES Cc1nc[nH]c1C1CCN(CC1)c1ncncc1-c1ccc(F)c(Cl)c1
InChI Key InChIKey=RWZXUCCSXXLDQI-UHFFFAOYSA-N
Data  1 IC50
  Tab Delimited (TSV)   2D SDfile   Computed 3D by Vconf -m prep SDfile
Find this compound or compounds like it in BindingDB:
Activity Spreadsheet -- Enzyme Inhibition Constant Data from BindingDB
Found 1 hit for monomerid = 50191847
TargetSodium/hydrogen exchanger 1(Homo sapiens (Human))
Pharmaceutical Research Institute
Curated by ChEMBL
LigandPNGBDBM50191847(5-(3-chloro-4-fluorophenyl)-4-(4-(4-methyl-1H-imid...)
Affinity DataIC50:  41nM. Assay description: Inhibition of human NHE1 expressed in Ap1 cell line
In DepthDetails ArticlePubMed